prospect-v
type: LexicalEntry
canonical form: prospect
sense: 00649724-v
part of speech: verb

00649724-v
type: LexicalConcept
in scheme: en-word.net
definition: explore for useful or valuable things or substances, such as minerals
ili: i24974
lexfile: verb.cognition
part of speech: verb
hypernym: 00649877-v