testing-n
type: LexicalEntry
canonical form: testing
sense: 00641218-n
part of speech: noun

00641218-n
type: LexicalConcept
in scheme: en-word.net
definition: the act of subjecting to experimental test in order to determine how well something works
example: they agreed to end the testing of atomic weapons
ili: i38787
lexfile: noun.act
part of speech: noun
hypernym: 00640799-n