process-v-1
type: LexicalEntry
canonical form: process
sense: 00640499-v
part of speech: verb

00640499-v
type: LexicalConcept
in scheme: en-word.net
definition: perform mathematical and logical operations on (data) according to programmed instructions in order to obtain the required information
example: The results of the elections were still being processed when he gave his acceptance speech
ili: i24929
lexfile: verb.cognition
part of speech: verb
hypernym: 00638921-v