examination-n
type: LexicalEntry
canonical form: examination
sense: 00637704-n
part of speech: noun

testing-n
type: LexicalEntry
canonical form: testing
sense: 00637704-n
part of speech: noun

00637704-n
type: LexicalConcept
in scheme: en-word.net
definition: the act of giving students or candidates a test (as by questions) to determine what they know or have learned
ili: i38768
lexfile: noun.act
part of speech: noun
hypernym: 00635107-n