stretch-n
type: LexicalEntry
canonical form: stretch
sense: 00629932-n
part of speech: noun

stretching-n
type: LexicalEntry
canonical form: stretching
sense: 00629932-n
part of speech: noun

00629932-n
type: LexicalConcept
in scheme: en-word.net
definition: exercise designed to extend the limbs and muscles to their full extent
ili: i38727
lexfile: noun.act
part of speech: noun
hypernym: 00625978-n