read-v
type: LexicalEntry
canonical form: read
sense: 00629157-v
part of speech: verb

scan-v
type: LexicalEntry
canonical form: scan
sense: 00629157-v
part of speech: verb

00629157-v
type: LexicalConcept
in scheme: en-word.net
definition: obtain data from magnetic tapes or other digital sources
example: This dictionary can be read by the computer
ili: i24887
lexfile: verb.cognition
part of speech: verb
hypernym: 00624823-v