dictate-v
type: LexicalEntry
canonical form: dictate
sense: 00628527-v
part of speech: verb

00628527-v
type: LexicalConcept
in scheme: en-word.net
definition: say out loud for the purpose of recording
example: He dictated a report to his secretary
ili: i24884
lexfile: verb.cognition
part of speech: verb
hypernym: 00628065-v