medium-a
type: LexicalEntry
canonical form: medium
sense: 00620371-s
part of speech: adjective

00620371-s
type: LexicalConcept
in scheme: en-word.net
definition: (meat) cooked until there is just a little pink meat inside
ili: i3432
lexfile: adj.all
part of speech: adjective satellite
similar: https://en-word.net/synset/00618376-a