law-n
type: LexicalEntry
canonical form: law
sense: 00612411-n
part of speech: noun

practice of law-n
type: LexicalEntry
canonical form: practice of law
sense: 00612411-n
part of speech: noun

00612411-n
type: LexicalConcept
in scheme: en-word.net
definition: the learned profession that is mastered by graduate study in a law school and that is responsible for the judicial system
example: he studied law at Yale
ili: i38638
lexfile: noun.act
part of speech: noun
domain topic: 08458195-n
hypernym: 00611641-n