funky-a
type: LexicalEntry
canonical form: funky
sense: 00612141-s
part of speech: adjective

00612141-s
type: LexicalConcept
in scheme: en-word.net
definition: stylish and modern in an unconventional way
example: she likes funky clothes
example: we did it all in black and white in a very funky sixties style
ili: i3380
lexfile: adj.all
part of speech: adjective satellite
similar: https://en-word.net/synset/00610798-a