understudy-v
type: LexicalEntry
canonical form: understudy
sense: 00606325-v
part of speech: verb

alternate-v
type: LexicalEntry
canonical form: alternate
sense: 00606325-v
part of speech: verb

00606325-v
type: LexicalConcept
in scheme: en-word.net
definition: be an understudy or alternate for a role
ili: i24784
lexfile: verb.cognition
part of speech: verb
hypernym: 00605971-v