appointment-n
type: LexicalEntry
canonical form: appointment
sense: 00587142-n
part of speech: noun

00587142-n
type: LexicalConcept
in scheme: en-word.net
definition: the job to which you are (or hope to be) appointed
example: he applied for an appointment in the treasury
ili: i38476
lexfile: noun.act
part of speech: noun
hypernym: 00583425-n