subordinate-v
type: LexicalEntry
canonical form: subordinate
sense: 00580789-v
part of speech: verb

subdue-v
type: LexicalEntry
canonical form: subdue
sense: 00580789-v
part of speech: verb

00580789-v
type: LexicalConcept
in scheme: en-word.net
definition: make subordinate, dependent, or subservient
example: Our wishes have to be subordinated to that of our ruler
ili: i24653
lexfile: verb.change
part of speech: verb
hypernym: 00532569-v