serve-n
type: LexicalEntry
canonical form: serve
sense: 00569467-n
part of speech: noun

service-n
type: LexicalEntry
canonical form: service
sense: 00569467-n
part of speech: noun

00569467-n
type: LexicalConcept
in scheme: en-word.net
definition: (sports) a stroke that puts the ball in play
example: his powerful serves won the game
ili: i38381
lexfile: noun.act
part of speech: noun
domain topic: 00483309-n
domain topic: 00481519-n
domain topic: 00480898-n
hypernym: 00567172-n