return-n
type: LexicalEntry
canonical form: return
sense: 00567335-n
part of speech: noun

00567335-n
type: LexicalConcept
in scheme: en-word.net
definition: a tennis stroke that sends the ball back to the other player
example: he won the point on a cross-court return
ili: i38370
lexfile: noun.act
part of speech: noun
hypernym: 00567172-n