cut-v
type: LexicalEntry
canonical form: cut
sense: 00562167-v
part of speech: verb

00562167-v
type: LexicalConcept
in scheme: en-word.net
definition: shorten as if by severing the edges or ends of
example: cut my hair
ili: i24551
lexfile: verb.change
part of speech: verb
hypernym: 00561970-v