reverse-n
type: LexicalEntry
canonical form: reverse
sense: 00560953-n
part of speech: noun

00560953-n
type: LexicalConcept
in scheme: en-word.net
definition: (American football) a running play in which a back running in one direction hands the ball to a back running in the opposite direction
ili: i38333
lexfile: noun.act
part of speech: noun
domain topic: 00470726-n
hypernym: 00559920-n