shake-v
type: LexicalEntry
canonical form: shake
sense: 00560633-v
part of speech: verb

00560633-v
type: LexicalConcept
in scheme: en-word.net
definition: bring to a specified condition by or as if by shaking
example: He was shaken from his dreams
example: shake the salt out of the salt shaker
ili: i24542
lexfile: verb.change
part of speech: verb
hypernym: 00126072-v