swing-v
type: LexicalEntry
canonical form: swing
sense: 00558293-v
part of speech: verb

00558293-v
type: LexicalConcept
in scheme: en-word.net
definition: alternate dramatically between high and low values
example: his mood swings
example: the market is swinging up and down
ili: i24530
lexfile: verb.change
part of speech: verb
hypernym: 00109468-v