sputter-v
type: LexicalEntry
canonical form: sputter
sense: 00557078-v
part of speech: verb

00557078-v
type: LexicalConcept
in scheme: en-word.net
definition: cause to undergo a process in which atoms are removed
example: The solar wind protons must sputter away the surface atoms of the dust
ili: i24524
lexfile: verb.change
part of speech: verb
hypernym: 00126072-v