shift-v
type: LexicalEntry
canonical form: shift
sense: 00556524-v
part of speech: verb

00556524-v
type: LexicalConcept
in scheme: en-word.net
definition: move from one setting or context to another
example: shift the emphasis
example: shift one's attention
ili: i24521
lexfile: verb.change
part of speech: verb
hypernym: 00126072-v