burst-n
type: LexicalEntry
canonical form: burst
sense: 00556362-n
part of speech: noun

fit-n
type: LexicalEntry
canonical form: fit
sense: 00556362-n
part of speech: noun

00556362-n
type: LexicalConcept
in scheme: en-word.net
definition: a sudden flurry of activity (often for no obvious reason)
example: a burst of applause
example: a fit of housecleaning
ili: i38312
lexfile: noun.act
part of speech: noun
hypernym: 00408356-n