clear-v
type: LexicalEntry
canonical form: clear
sense: 00550297-v
part of speech: verb

00550297-v
type: LexicalConcept
in scheme: en-word.net
definition: make clear, bright, light, or translucent
example: The water had to be cleared through filtering
ili: i24488
lexfile: verb.change
part of speech: verb
hypernym: 00126072-v