intonation-n
type: LexicalEntry
canonical form: intonation
sense: 00545879-n
part of speech: noun

00545879-n
type: LexicalConcept
in scheme: en-word.net
definition: the production of musical tones (by voice or instrument); especially the exactitude of the pitch relations
ili: i38253
lexfile: noun.act
part of speech: noun
hypernym: 00544270-n