transform-v
type: LexicalEntry
canonical form: transform
sense: 00545091-v
part of speech: verb

00545091-v
type: LexicalConcept
in scheme: en-word.net
definition: subject to a mathematical transformation
ili: i24455
lexfile: verb.change
part of speech: verb
hypernym: 00126072-v