scattered-a
type: LexicalEntry
canonical form: scattered
sense: 00544319-s
part of speech: adjective

00544319-s
type: LexicalConcept
in scheme: en-word.net
definition: occurring or distributed over widely spaced and irregular intervals in time or space
example: scattered showers
example: scattered villages
ili: i3036
lexfile: adj.all
part of speech: adjective satellite
similar: https://en-word.net/synset/00542013-a