expand-v
type: LexicalEntry
canonical form: expand
sense: 00542243-v
part of speech: verb

00542243-v
type: LexicalConcept
in scheme: en-word.net
definition: make bigger or wider in size, volume, or quantity
example: expand the house by adding another wing
ili: i24440
lexfile: verb.change
part of speech: verb
hypernym: 00154586-v