lead up-v
type: LexicalEntry
canonical form: lead up
sense: 00540626-v
part of speech: verb

initiate-v
type: LexicalEntry
canonical form: initiate
sense: 00540626-v
part of speech: verb

00540626-v
type: LexicalConcept
in scheme: en-word.net
definition: set in motion, start an event or prepare the way for
example: Hitler's attack on Poland led up to World War II
ili: i24432
lexfile: verb.change
part of speech: verb
hypernym: 01631641-v