vitrify-v
type: LexicalEntry
canonical form: vitrify
sense: 00538972-v
part of speech: verb

00538972-v
type: LexicalConcept
in scheme: en-word.net
definition: change into glass or a glass-like substance by applying heat
ili: i24423
lexfile: verb.change
part of speech: verb
hypernym: 00126072-v