vitrify-v
type: LexicalEntry
canonical form: vitrify
sense: 00538839-v
part of speech: verb

00538839-v
type: LexicalConcept
in scheme: en-word.net
definition: undergo vitrification; become glassy or glass-like
ili: i24422
lexfile: verb.change
part of speech: verb
hypernym: 00109468-v