dark-a
type: LexicalEntry
canonical form: dark
sense: 00536470-s
part of speech: adjective

obscure-a
type: LexicalEntry
canonical form: obscure
sense: 00536470-s
part of speech: adjective

00536470-s
type: LexicalConcept
in scheme: en-word.net
definition: marked by difficulty of style or expression
example: much that was dark is now quite clear to me
example: those who do not appreciate Kafka's work say his style is obscure
ili: i2986
lexfile: adj.all
part of speech: adjective satellite
similar: https://en-word.net/synset/00536071-a