dance step-n
type: LexicalEntry
canonical form: dance step
sense: 00534959-n
part of speech: noun

step-n
type: LexicalEntry
canonical form: step
sense: 00534959-n
part of speech: noun

00534959-n
type: LexicalConcept
in scheme: en-word.net
definition: a sequence of foot movements that make up a particular dance
example: he taught them the waltz step
ili: i38188
lexfile: noun.act
part of speech: noun
hypernym: 00283971-n