production-n
type: LexicalEntry
canonical form: production
sense: 00523792-n
part of speech: noun

00523792-n
type: LexicalConcept
in scheme: en-word.net
definition: (law) the act of exhibiting in a court of law
example: the appellate court demanded the production of all documents
ili: i38135
lexfile: noun.act
part of speech: noun
domain topic: 08458195-n
hypernym: 00523201-n