cut in-v
type: LexicalEntry
canonical form: cut in
sense: 00521274-v
part of speech: verb

00521274-v
type: LexicalConcept
in scheme: en-word.net
definition: interrupt a dancing couple in order to take one of them as one's own partner
example: Jim always cuts in!
ili: i24317
lexfile: verb.change
part of speech: verb
hypernym: 00521437-v