capriole-n
type: LexicalEntry
canonical form: capriole
sense: 00513362-n
part of speech: noun

00513362-n
type: LexicalConcept
in scheme: en-word.net
definition: (dressage) a vertical jump of a trained horse with a kick of the hind legs at the top of the jump
ili: i38073
lexfile: noun.act
part of speech: noun
domain topic: 00288844-n
hypernym: 00120388-n