clarify-v
type: LexicalEntry
canonical form: clarify
sense: 00506232-v
part of speech: verb

00506232-v
type: LexicalConcept
in scheme: en-word.net
definition: make clear by removing impurities or solids, as by heating
example: clarify the butter
example: clarify beer
ili: i24236
lexfile: verb.change
part of speech: verb
domain topic: 00244785-n
hypernym: 00126072-v