emulsify-v
type: LexicalEntry
canonical form: emulsify
sense: 00501915-v
part of speech: verb

00501915-v
type: LexicalConcept
in scheme: en-word.net
definition: cause to become an emulsion; make into an emulsion
ili: i24215
lexfile: verb.change
part of speech: verb
causes: 00501719-v
hypernym: 00126072-v