outspoken-a
type: LexicalEntry
canonical form: outspoken
sense: 00501575-s
part of speech: adjective

vocal-a
type: LexicalEntry
canonical form: vocal
sense: 00501575-s
part of speech: adjective

00501575-s
type: LexicalConcept
in scheme: en-word.net
definition: given to expressing yourself freely or insistently
example: outspoken in their opposition to segregation
example: a vocal assembly
ili: i2809
lexfile: adj.all
part of speech: adjective satellite
similar: https://en-word.net/synset/00496952-a