quarantine-v
type: LexicalEntry
canonical form: quarantine
sense: 00497347-v
part of speech: verb

00497347-v
type: LexicalConcept
in scheme: en-word.net
definition: place into enforced isolation, as for medical reasons
example: My dog was quarantined before he could live in England
ili: i24189
lexfile: verb.change
part of speech: verb
hypernym: 00495205-v