segregate-v
type: LexicalEntry
canonical form: segregate
sense: 00495549-v
part of speech: verb

00495549-v
type: LexicalConcept
in scheme: en-word.net
definition: separate or isolate (one thing) from another and place in a group apart from others
example: the sun segregates the carbon
example: large mining claims are segregated into smaller claims
ili: i24181
lexfile: verb.change
part of speech: verb
hypernym: 00495205-v