piquet-n
type: LexicalEntry
canonical form: piquet
sense: 00495304-n
part of speech: noun

00495304-n
type: LexicalConcept
in scheme: en-word.net
definition: a card game for two players using a reduced pack of 32 cards
ili: i37977
lexfile: noun.act
part of speech: noun
hypernym: 00489236-n