contract-n
type: LexicalEntry
canonical form: contract
sense: 00492377-n
part of speech: noun

contract bridge-n
type: LexicalEntry
canonical form: contract bridge
sense: 00492377-n
part of speech: noun

00492377-n
type: LexicalConcept
in scheme: en-word.net
definition: a variety of bridge in which the bidder receives points toward game only for the number of tricks they bid
ili: i37962
lexfile: noun.act
part of speech: noun
hypernym: 00491580-n