polarize-v
type: LexicalEntry
canonical form: polarize
sense: 00488286-v
part of speech: verb

polarise-v
type: LexicalEntry
canonical form: polarise
sense: 00488286-v
part of speech: verb

00488286-v
type: LexicalConcept
in scheme: en-word.net
definition: cause to concentrate about two conflicting or contrasting positions
ili: i24145
lexfile: verb.change
part of speech: verb
hypernym: 01559703-v