spiritualize-v
type: LexicalEntry
canonical form: spiritualize
sense: 00477244-v
part of speech: verb

spiritualise-v
type: LexicalEntry
canonical form: spiritualise
sense: 00477244-v
part of speech: verb

00477244-v
type: LexicalConcept
in scheme: en-word.net
definition: purify from the corrupting influences of the world
example: During his stay at the ashram he was spiritualized
ili: i24093
lexfile: verb.change
part of speech: verb
hypernym: 00476750-v