obliterate-v
type: LexicalEntry
canonical form: obliterate
sense: 00473161-v
part of speech: verb

00473161-v
type: LexicalConcept
in scheme: en-word.net
definition: do away with completely, without leaving a trace
ili: i24075
lexfile: verb.change
part of speech: verb
hypernym: 00472642-v