build in-v
type: LexicalEntry
canonical form: build in
sense: 00468064-v
part of speech: verb

00468064-v
type: LexicalConcept
in scheme: en-word.net
definition: make something an integral part of something else
example: we can build in a special clause to make the contract better for you
ili: i24053
lexfile: verb.change
part of speech: verb
hypernym: 00467564-v