hunt-n
type: LexicalEntry
canonical form: hunt
sense: 00453279-n
part of speech: noun

hunting-n
type: LexicalEntry
canonical form: hunting
sense: 00453279-n
part of speech: noun

00453279-n
type: LexicalConcept
in scheme: en-word.net
definition: the pursuit and killing or capture of wild animals regarded as a sport
ili: i37789
lexfile: noun.act
part of speech: noun
hypernym: 00434601-n
hypernym: 00452852-n