give way-v
type: LexicalEntry
canonical form: give way
sense: 00436056-v
part of speech: verb

yield-v
type: LexicalEntry
canonical form: yield
sense: 00436056-v
part of speech: verb

00436056-v
type: LexicalConcept
in scheme: en-word.net
definition: end resistance, as under pressure or force
example: The door yielded to repeated blows with a battering ram
ili: i23901
lexfile: verb.change
part of speech: verb
hypernym: 00109468-v