heighten-v
type: LexicalEntry
canonical form: heighten
sense: 00433234-v
part of speech: verb

00433234-v
type: LexicalConcept
in scheme: en-word.net
definition: make more extreme; raise in quantity, degree, or intensity
example: heightened interest
ili: i23887
lexfile: verb.change
part of speech: verb
hypernym: 00153083-v