rack-n
type: LexicalEntry
canonical form: rack
sense: 00424919-n
part of speech: noun

00424919-n
type: LexicalConcept
in scheme: en-word.net
definition: a form of torture in which pain is inflicted by stretching the body
ili: i37632
lexfile: noun.act
part of speech: noun
hypernym: 00422440-n